BDBM50319591 (2R)-(4-[3-(2-Methylphenyl)-2,2-dioxido-2,1,3-benzothiadiazol-1(3H)-yl]-1-(methylamino)butan-2-ol::CHEMBL1082292
SMILES CNC[C@H](O)CCN1c2ccccc2N(c2ccccc2C)S1(=O)=O
InChI Key InChIKey=HSMMZWQHSZFBQK-OAHLLOKOSA-N
Data  3 IC50
  Tab Delimited (TSV)   2D SDfile   Computed 3D by Vconf -m prep SDfile
Find this compound or compounds like it in BindingDB:
Activity Spreadsheet -- Enzyme Inhibition Constant Data from BindingDB
Found 3 hits for monomerid = 50319591
TargetSodium-dependent noradrenaline transporter(Homo sapiens (Human))
Pfizer
Curated by ChEMBL
LigandPNGBDBM50319591((2R)-(4-[3-(2-Methylphenyl)-2,2-dioxido-2,1,3-benz...)
Affinity DataIC50:  155nM. Assay description: Displacement of [3H]nisoxetine from human NET expressed in MDCK-Net6 cells
In DepthDetails ArticlePubMed
TargetSodium-dependent dopamine transporter(Homo sapiens (Human))
Pfizer
Curated by ChEMBL
LigandPNGBDBM50319591((2R)-(4-[3-(2-Methylphenyl)-2,2-dioxido-2,1,3-benz...)
Affinity DataIC50:  1.87E+3nM. Assay description: Displacement of [3H]WIN35428 from human recombinant DAT expressed in CHO cells
In DepthDetails ArticlePubMed
TargetSodium-dependent noradrenaline transporter(Homo sapiens (Human))
Pfizer
Curated by ChEMBL
LigandPNGBDBM50319591((2R)-(4-[3-(2-Methylphenyl)-2,2-dioxido-2,1,3-benz...)
Affinity DataIC50:  294nM. Assay description: Inhibition of human NET-mediated norepinephrine uptake in MDCK-Net6 cells
In DepthDetails ArticlePubMed