BDBM50320333 7-methoxy-8-(3-methylbut-2-enyl)-2H-chromen-2-one::CHEMBL1084300
SMILES [#6]-[#8]-c1ccc2-[#6]-[#6]-[#6](=O)-[#8]-c2c1-[#6]\[#6]=[#6](\[#6])-[#6]
InChI Key InChIKey=HDCUYVWVMGOCTK-UHFFFAOYSA-N
Data  1 IC50
  Tab Delimited (TSV)   2D SDfile   Computed 3D by Vconf -m prep SDfile
Find this compound or compounds like it in BindingDB:
Activity Spreadsheet -- Enzyme Inhibition Constant Data from BindingDB
Found 1 hit for monomerid = 50320333
TargetExportin-1(Homo sapiens (Human))
Osaka University
Curated by ChEMBL
LigandPNGBDBM50320333(7-methoxy-8-(3-methylbut-2-enyl)-2H-chromen-2-one ...)
Affinity DataIC50: >2.50E+4nM. Assay description: Inhibition of CRM1-mediated hemagglutinin-tagged HIV1 Rev protein nuclear export in human HeLa cells assessed as nucleus localization after 12 hrs by...
In DepthDetails ArticlePubMed