BDBM50320484 1-((2-phenoxyphenyl)(3-(trifluoromethoxy)benzyl)amino)pentan-2-ol::CHEMBL1165656
SMILES CCCC(O)CN(Cc1cccc(OC(F)(F)F)c1)c1ccccc1Oc1ccccc1
InChI Key InChIKey=PCNDHKJMLDCOGU-UHFFFAOYSA-N
Data  1 IC50
  Tab Delimited (TSV)   2D SDfile   Computed 3D by Vconf -m prep SDfile
Find this compound or compounds like it in BindingDB:
Activity Spreadsheet -- Enzyme Inhibition Constant Data from BindingDB
Found 1 hit for monomerid = 50320484
TargetCholesteryl ester transfer protein(Oryctolagus cuniculus)
Al-Zaytoonah Private University Of Jordan
Curated by ChEMBL
LigandPNGBDBM50320484(1-((2-phenoxyphenyl)(3-(trifluoromethoxy)benzyl)am...)
Affinity DataIC50:  3.60E+3nM. Assay description: Inhibition of CETP in rabbit serum after 1 hr by fluorescent cholesteryl esters transfer assay
In DepthDetails ArticlePubMed