BDBM50320485 2-((2-phenoxyphenyl)(3-(trifluoromethoxy)benzyl)amino)-1-(4-(trifluoromethyl)phenyl)ethanol::CHEMBL1165038
SMILES OC(CN(Cc1cccc(OC(F)(F)F)c1)c1ccccc1Oc1ccccc1)c1ccc(cc1)C(F)(F)F
InChI Key InChIKey=BOJTTYRDGCJXGF-UHFFFAOYSA-N
Data  1 IC50
  Tab Delimited (TSV)   2D SDfile   Computed 3D by Vconf -m prep SDfile
Find this compound or compounds like it in BindingDB:
Activity Spreadsheet -- Enzyme Inhibition Constant Data from BindingDB
Found 1 hit for monomerid = 50320485
TargetCholesteryl ester transfer protein(Oryctolagus cuniculus)
Al-Zaytoonah Private University Of Jordan
Curated by ChEMBL
LigandPNGBDBM50320485(2-((2-phenoxyphenyl)(3-(trifluoromethoxy)benzyl)am...)
Affinity DataIC50:  1.80E+4nM. Assay description: Inhibition of CETP in rabbit serum after 1 hr by fluorescent cholesteryl esters transfer assay
In DepthDetails ArticlePubMed