BDBM50320617 2-(4-chlorophenyl)-3-(4-(phenylamino)-6-(piperidin-1-yl)-1,3,5-triazin-2-ylamino)thiazolidin-4-one::CHEMBL1165731
SMILES Clc1ccc(cc1)C1SCC(=O)N1Nc1nc(Nc2ccccc2)nc(n1)N1CCCCC1
InChI Key InChIKey=YKWQRRXPVMJRGS-UHFFFAOYSA-N
Data  1 IC50
  Tab Delimited (TSV)   2D SDfile   Computed 3D by Vconf -m prep SDfile
Find this compound or compounds like it in BindingDB:
Activity Spreadsheet -- Enzyme Inhibition Constant Data from BindingDB
Found 1 hit for monomerid = 50320617
TargetBeta-secretase 1(Homo sapiens (Human))
Applied Science University
Curated by ChEMBL
LigandPNGBDBM50320617(2-(4-chlorophenyl)-3-(4-(phenylamino)-6-(piperidin...)
Affinity DataIC50:  1.00E+5nM. Assay description: Inhibition of BACE1 after 2 hrs by FRET assay
In DepthDetails ArticlePubMed