BDBM50320646 2-(4-benzylpiperazin-1-yl)-N'-(2-hydroxy-3,5-diiodobenzylidene)acetohydrazide::CHEMBL1164096
SMILES Oc1c(I)cc(I)cc1C=NNC(=O)CN1CCN(Cc2ccccc2)CC1
InChI Key InChIKey=CTNSPJSYKWQDLD-UHFFFAOYSA-N
Data  1 IC50
  Tab Delimited (TSV)   2D SDfile   Computed 3D by Vconf -m prep SDfile
Find this compound or compounds like it in BindingDB:
Activity Spreadsheet -- Enzyme Inhibition Constant Data from BindingDB
Found 1 hit for monomerid = 50320646
TargetBeta-secretase 1(Homo sapiens (Human))
Applied Science University
Curated by ChEMBL
LigandPNGBDBM50320646(2-(4-benzylpiperazin-1-yl)-N'-(2-hydroxy-3,5-diiod...)
Affinity DataIC50:  1.00E+5nM. Assay description: Inhibition of BACE1 after 2 hrs by FRET assay
In DepthDetails ArticlePubMed