BDBM50320659 3-(3-chloro-4-methoxyphenyl)-N-(2-(6-methylpyridin-2-ylamino)-2-oxoethyl)-4-oxo-3,4-dihydrophthalazine-1-carboxamide::CHEMBL1165196
SMILES COc1ccc(cc1Cl)-n1nc(C(=O)NCC(=O)Nc2cccc(C)n2)c2ccccc2c1=O
InChI Key InChIKey=GOAKLHOFXCKNOE-UHFFFAOYSA-N
Data  1 IC50
  Tab Delimited (TSV)   2D SDfile   Computed 3D by Vconf -m prep SDfile
Find this compound or compounds like it in BindingDB:
Activity Spreadsheet -- Enzyme Inhibition Constant Data from BindingDB
Found 1 hit for monomerid = 50320659
TargetBeta-secretase 1(Homo sapiens (Human))
Applied Science University
Curated by ChEMBL
LigandPNGBDBM50320659(3-(3-chloro-4-methoxyphenyl)-N-(2-(6-methylpyridin...)
Affinity DataIC50:  1.00E+5nM. Assay description: Inhibition of BACE1 after 2 hrs by FRET assay
In DepthDetails ArticlePubMed