BDBM50320674 6-(N-methyl-N-m-tolylsulfamoyl)-N-(2-morpholinoethyl)-4-oxo-1,4-dihydroquinoline-3-carboxamide::CHEMBL1163703
SMILES CN(c1cccc(C)c1)S(=O)(=O)c1ccc2ncc(C(=O)NCCN3CCOCC3)c(O)c2c1
InChI Key InChIKey=HPBHCRXYZNPBMD-UHFFFAOYSA-N
Data  1 IC50
  Tab Delimited (TSV)   2D SDfile   Computed 3D by Vconf -m prep SDfile
Find this compound or compounds like it in BindingDB:
Activity Spreadsheet -- Enzyme Inhibition Constant Data from BindingDB
Found 1 hit for monomerid = 50320674
TargetBeta-secretase 1(Homo sapiens (Human))
Applied Science University
Curated by ChEMBL
LigandPNGBDBM50320674(6-(N-methyl-N-m-tolylsulfamoyl)-N-(2-morpholinoeth...)
Affinity DataIC50:  1.00E+5nM. Assay description: Inhibition of BACE1 after 2 hrs by FRET assay
In DepthDetails ArticlePubMed