BDBM50320693 3-Carbamoyl-1-{[3-(4-chloro-phenylcarbamoyl)-phenylcarbamoyl]-methyl}-pyridiniumchloride::CHEMBL1164543
SMILES NC(=O)c1ccc[n+](CC(=O)Nc2cccc(c2)C(=O)Nc2ccc(Cl)cc2)c1
InChI Key InChIKey=SUBXQVGRASWGDA-UHFFFAOYSA-O
Data  1 IC50
  Tab Delimited (TSV)   2D SDfile   Computed 3D by Vconf -m prep SDfile
Find this compound or compounds like it in BindingDB:
Activity Spreadsheet -- Enzyme Inhibition Constant Data from BindingDB
Found 1 hit for monomerid = 50320693
TargetBeta-secretase 1(Homo sapiens (Human))
Applied Science University
Curated by ChEMBL
LigandPNGBDBM50320693(3-Carbamoyl-1-{[3-(4-chloro-phenylcarbamoyl)-pheny...)
Affinity DataIC50:  3.02E+4nM. Assay description: Inhibition of BACE1 after 2 hrs by FRET assay
In DepthDetails ArticlePubMed