BDBM50320694 3-Carbamoyl-1-{[3-(4-methoxy-phenylcarbamoyl)-phenylcarbamoyl]-methyl}-pyridiniumchloride::CHEMBL1164643
SMILES COc1ccc(NC(=O)c2cccc(NC(=O)C[n+]3cccc(c3)C(N)=O)c2)cc1
InChI Key InChIKey=CWMGOSWEOUVWQO-UHFFFAOYSA-O
Data  1 IC50
  Tab Delimited (TSV)   2D SDfile   Computed 3D by Vconf -m prep SDfile
Find this compound or compounds like it in BindingDB:
Activity Spreadsheet -- Enzyme Inhibition Constant Data from BindingDB
Found 1 hit for monomerid = 50320694
TargetBeta-secretase 1(Homo sapiens (Human))
Applied Science University
Curated by ChEMBL
LigandPNGBDBM50320694(3-Carbamoyl-1-{[3-(4-methoxy-phenylcarbamoyl)-phen...)
Affinity DataIC50:  1.90E+3nM. Assay description: Inhibition of BACE1 after 2 hrs by FRET assay
In DepthDetails ArticlePubMed