BDBM50320829 (oxalylamino-methylene)-thiophenesulfonamide::CHEMBL1164991
SMILES NS(=O)(=O)C1=CCS2=C1C(=O)C(=O)C2=N
InChI Key InChIKey=MPGGUSRWNMZOGY-UHFFFAOYSA-N
Data  1 IC50
  Tab Delimited (TSV)   2D SDfile   Computed 3D by Vconf -m prep SDfile
Find this compound or compounds like it in BindingDB:
Activity Spreadsheet -- Enzyme Inhibition Constant Data from BindingDB
Found 1 hit for monomerid = 50320829
TargetTYR_PHOSPHATASE_2 domain-containing protein(Mycobacterium tuberculosis)
Universidade Federal De Santa Catarina
Curated by ChEMBL
LigandPNGBDBM50320829((oxalylamino-methylene)-thiophenesulfonamide | CHE...)
Affinity DataIC50:  440nM. Assay description: Inhibition of N-terminal histidine-tagged Mycobacterium tuberculosis PTPB expressed in Escherichia coli BL21 (DE3) after 45 mins by fluorescence assa...
In DepthDetails ArticlePubMed