BDBM50320833 CHEMBL1163296
SMILES NCCC[C@H](NC(=O)[C@@H]1CCCN1C(=O)CNC(=O)[C@@H]1C[C@@H](O)CN1C(=O)[C@@H]1CCCN1C(=O)CNC(=O)[C@@H]1C[C@@H](O)CN1C(=O)[C@@H]1CCCN1C(=O)CNC(=O)[C@@H]1C[C@@H](O)CN1C(=O)[C@@H]1CCCN1C(=O)[C@@H](N)CS)C(=O)NCC(=O)N1CCC[C@H]1C(=O)N1C[C@@H](O)C[C@H]1C(=O)NCC(=O)N1CCC[C@H]1C(=O)N1C[C@@H](O)C[C@H]1C(=O)NCC(=O)N1CCC[C@H]1C(=O)N1C[C@@H](O)C[C@H]1C(=O)NCC(=O)N1CCC[C@H]1C(=O)N1C[C@H](O)C[C@H]1C(=O)NCC(O)=O
InChI Key InChIKey=WBZDJHZLWRGSMF-OOYNNWNISA-N
Data  1 IC50
  Tab Delimited (TSV)   2D SDfile   Computed 3D by Vconf -m prep SDfile
Find this compound or compounds like it in BindingDB:
Activity Spreadsheet -- Enzyme Inhibition Constant Data from BindingDB
Found 1 hit for monomerid = 50320833
TargetSerpin H1(Mus musculus)
Waseda University
Curated by ChEMBL
LigandPNGBDBM50320833(CHEMBL1163296)
Affinity DataIC50: >1.00E+5nM. Assay description: Binding affinity to mouse recombinant HSP47 expressed in Escherichia coli JM109 after 10 mins by surface plasmon resonance assay
In DepthDetails ArticlePubMed