BDBM50320924 5-(Cyclohexylmethoxy)-3-(4-ethylphenyl)-4H-chromen-4-one::CHEMBL1164394
SMILES CCc1ccc(cc1)-c1coc2cccc(OCC3CCCCC3)c2c1=O
InChI Key InChIKey=GZNKMJLMNBERTG-UHFFFAOYSA-N
Data  1 IC50
  Tab Delimited (TSV)   2D SDfile   Computed 3D by Vconf -m prep SDfile
Find this compound or compounds like it in BindingDB:
Activity Spreadsheet -- Enzyme Inhibition Constant Data from BindingDB
Found 1 hit for monomerid = 50320924
TargetInterleukin-5(Mus musculus)
Chungnam National University
Curated by ChEMBL
LigandPNGBDBM50320924(5-(Cyclohexylmethoxy)-3-(4-ethylphenyl)-4H-chromen...)
Affinity DataIC50: >3.00E+4nM. Assay description: Inhibition of IL5-mediated proliferation of mouse Y16 cells by WST1 assay
In DepthDetails ArticlePubMed