BDBM50321148 3-(4-(4-fluorobenzoyl)piperidine-1-carbonyl)benzonitrile::CHEMBL1163878
SMILES Fc1ccc(cc1)C(=O)C1CCN(CC1)C(=O)c1cccc(c1)C#N
InChI Key InChIKey=SHCQDULIDLZWEK-UHFFFAOYSA-N
Data  1 IC50
  Tab Delimited (TSV)   2D SDfile   Computed 3D by Vconf -m prep SDfile
Find this compound or compounds like it in BindingDB:
Activity Spreadsheet -- Enzyme Inhibition Constant Data from BindingDB
Found 1 hit for monomerid = 50321148
Target11-beta-hydroxysteroid dehydrogenase 1(Homo sapiens (Human))
Astrazeneca
Curated by ChEMBL
LigandPNGBDBM50321148(3-(4-(4-fluorobenzoyl)piperidine-1-carbonyl)benzon...)
Affinity DataIC50: >3.00E+4nM. Assay description: Inhibition of human 11beta-HSD1 by competitive binding assay
In DepthDetails ArticlePubMed