BDBM50321169 (1-(3,4-dichlorobenzoyl)piperidin-4-yl)(4-fluorophenyl)methanone::CHEMBL1163486
SMILES Fc1ccc(cc1)C(=O)C1CCN(CC1)C(=O)c1ccc(Cl)c(Cl)c1
InChI Key InChIKey=QGSLBCNJESNRTA-UHFFFAOYSA-N
Data  1 IC50
  Tab Delimited (TSV)   2D SDfile   Computed 3D by Vconf -m prep SDfile
Find this compound or compounds like it in BindingDB:
Activity Spreadsheet -- Enzyme Inhibition Constant Data from BindingDB
Found 1 hit for monomerid = 50321169
Target11-beta-hydroxysteroid dehydrogenase 1(Homo sapiens (Human))
Astrazeneca
Curated by ChEMBL
LigandPNGBDBM50321169((1-(3,4-dichlorobenzoyl)piperidin-4-yl)(4-fluoroph...)
Affinity DataIC50:  3.52E+3nM. Assay description: Inhibition of human 11beta-HSD1 by competitive binding assay
In DepthDetails ArticlePubMed