BDBM50321295 (2S,3R,4R,5S,6R)-2-(4-chloro-5-(4-ethylbenzyl)-2-((3-hydroxypropoxy)methyl)phenyl)-6-(hydroxymethyl)-tetrahydro-2H-pyran-3,4,5-triol::CHEMBL1163753
SMILES CCc1ccc(Cc2cc([C@@H]3O[C@H](CO)[C@@H](O)[C@H](O)[C@H]3O)c(COCCCO)cc2Cl)cc1
InChI Key InChIKey=AGYXXIHBHOZKHJ-RXFVIIJJSA-N
Data  2 IC50
  Tab Delimited (TSV)   2D SDfile   Computed 3D by Vconf -m prep SDfile
Find this compound or compounds like it in BindingDB:
Activity Spreadsheet -- Enzyme Inhibition Constant Data from BindingDB
Found 2 hits for monomerid = 50321295
TargetSodium/glucose cotransporter 1(Homo sapiens (Human))
Chinese Academy Of Sciences
Curated by ChEMBL
LigandPNGBDBM50321295((2S,3R,4R,5S,6R)-2-(4-chloro-5-(4-ethylbenzyl)-2-(...)
Affinity DataIC50:  1.03E+5nM. Assay description: Inhibition of human SGLT1 expressed in african green monkey COS7 cells assessed as inhibition of [14C]-alpha-methyl-D-glucopyranoside uptake after 2 ...
In DepthDetails ArticlePubMed
TargetSodium/glucose cotransporter 2(Homo sapiens (Human))
Chinese Academy Of Sciences
Curated by ChEMBL
LigandPNGBDBM50321295((2S,3R,4R,5S,6R)-2-(4-chloro-5-(4-ethylbenzyl)-2-(...)
Affinity DataIC50:  110nM. Assay description: Inhibition of human SGLT2 expressed in HEK293 cells assessed as inhibition of [14C]-alpha-methyl-D-glucopyranoside uptake after 1.5 hrs by liquid sci...
In DepthDetails ArticlePubMed