BDBM50321428 1-(4-(4-(6-amino-5-(benzo[d]oxazol-2-yl)pyridin-3-yl)-1H-pyrazol-1-yl)piperidin-1-yl)propan-1-one tetrahydrochloride::CHEMBL1170926
SMILES CCC(=O)N1CCC(CC1)n1cc(cn1)-c1cnc(N)c(c1)-c1nc2ccccc2o1
InChI Key InChIKey=GEEVDRJPBXLINN-UHFFFAOYSA-N
Data  1 IC50
  Tab Delimited (TSV)   2D SDfile   Computed 3D by Vconf -m prep SDfile
Find this compound or compounds like it in BindingDB:
Activity Spreadsheet -- Enzyme Inhibition Constant Data from BindingDB
Found 1 hit for monomerid = 50321428
TargetHepatocyte growth factor receptor(Homo sapiens (Human))
Korea Research Institute Of Chemical Technology
Curated by ChEMBL
LigandPNGBDBM50321428(1-(4-(4-(6-amino-5-(benzo[d]oxazol-2-yl)pyridin-3-...)
Affinity DataIC50:  7nM. Assay description: Inhibition of recombinant c-MET by HTRF assay
In DepthDetails ArticlePubMed