BDBM50321865 2,3-Dihydro-indole-1-carboxylic acid [6-(2-methyl-pyridin-3-yloxy)-pyridin-3-yl]-amide::CHEMBL56232::N-(6-(2-methylpyridin-3-yloxy)pyridin-3-yl)indoline-1-carboxamide
SMILES Cc1ncccc1Oc1ccc(NC(=O)N2CCc3ccccc23)cn1
InChI Key InChIKey=BKNJMUFKPUHRFM-UHFFFAOYSA-N
Data  5 KI
  Tab Delimited (TSV)   2D SDfile   Computed 3D by Vconf -m prep SDfile
Find this compound or compounds like it in BindingDB:
Activity Spreadsheet -- Enzyme Inhibition Constant Data from BindingDB
Found 5 hits for monomerid = 50321865
Target5-hydroxytryptamine receptor 2C(Homo sapiens (Human))
Smithkline Beecham Pharmaceuticals
Curated by ChEMBL
LigandPNGBDBM50321865(2,3-Dihydro-indole-1-carboxylic acid [6-(2-methyl-...)
Affinity DataKi:  100nM. Assay description: Binding affinity towards human cloned 5-hydroxytryptamine 2C receptor of HEK293 cells by displacement of [3H]mesulergine
In DepthDetails ArticlePubMed
Target5-hydroxytryptamine receptor 2C(Homo sapiens (Human))
Smithkline Beecham Pharmaceuticals
Curated by ChEMBL
LigandPNGBDBM50321865(2,3-Dihydro-indole-1-carboxylic acid [6-(2-methyl-...)
Affinity DataKi:  100nM. Assay description: Displacement of [3H]mesulergine from human cloned 5HT2C receptor expressed in HEK293 cells after 90 mins by liquid scintillation counting
In DepthDetails ArticlePubMed
Target5-hydroxytryptamine receptor 2B(Homo sapiens (Human))
Smithkline Beecham Pharmaceuticals
Curated by ChEMBL
LigandPNGBDBM50321865(2,3-Dihydro-indole-1-carboxylic acid [6-(2-methyl-...)
Affinity DataKi:  2.00E+3nM. Assay description: Binding affinity towards human cloned 5-HT2B receptor of HEK293 cells by displacement of [3H]5-HT
In DepthDetails ArticlePubMed
Target5-hydroxytryptamine receptor 2A(Homo sapiens (Human))
Smithkline Beecham Pharmaceuticals
Curated by ChEMBL
LigandPNGBDBM50321865(2,3-Dihydro-indole-1-carboxylic acid [6-(2-methyl-...)
Affinity DataKi: >1.00E+4nM. Assay description: Binding affinity towards human cloned 5-hydroxytryptamine 2A receptor of HEK293 cells by displacement of [3H]ketanserin
In DepthDetails ArticlePubMed
Target5-hydroxytryptamine receptor 2A(Homo sapiens (Human))
Smithkline Beecham Pharmaceuticals
Curated by ChEMBL
LigandPNGBDBM50321865(2,3-Dihydro-indole-1-carboxylic acid [6-(2-methyl-...)
Affinity DataKi: >1.00E+4nM. Assay description: Displacement of [3H]methylspiperone from human cloned 5HT2A receptor expressed in HEK293 cells after 90 mins by liquid scintillation counting
In DepthDetails ArticlePubMed