BDBM50322320 2-deoxy-6-phospho-D-gluconate::CHEMBL1173784
SMILES O[C@H](COP(O)(O)=O)[C@@H](O)[C@H](O)CC(O)=O
InChI Key InChIKey=LTHDIZOWAIGONP-KODRXGBYSA-N
Data  1 KI
  Tab Delimited (TSV)   2D SDfile   Computed 3D by Vconf -m prep SDfile
Find this compound or compounds like it in BindingDB:
Activity Spreadsheet -- Enzyme Inhibition Constant Data from BindingDB
Found 1 hit for monomerid = 50322320
Target6-phosphogluconate dehydrogenase, decarboxylating(Ovis aries)
University Of Dundee
Curated by ChEMBL
LigandPNGBDBM50322320(2-deoxy-6-phospho-D-gluconate | CHEMBL1173784)
Affinity DataKi:  7.48E+5nM. Assay description: Inhibition of sheep 6PGDH expressed in Escherichia coli by spectroscopy
In DepthDetails ArticlePubMed