BDBM50322505 (2S)-2-((4R)-4-((3R,7R,8R,9S,10S,13R,14S,17R)-3,7-dihydroxy-10,13-dimethylhexadecahydro-1H-cyclopenta[a]phenanthren-17-yl)pentanamido)-5-(4-methoxyphenylamino)-5-oxopentanoate::CHEMBL1170064
SMILES COc1ccc(NC(=O)CC[C@H](NC(=O)CC[C@@H](C)[C@H]2CC[C@H]3[C@@H]4[C@H](O)C[C@H]5C[C@H](O)CC[C@]5(C)[C@H]4CC[C@]23C)C(O)=O)cc1
InChI Key InChIKey=OYFWOZXHJLXIPG-SHZFHUAASA-N
Data  1 KI
  Tab Delimited (TSV)   2D SDfile   Computed 3D by Vconf -m prep SDfile
Find this compound or compounds like it in BindingDB:
Activity Spreadsheet -- Enzyme Inhibition Constant Data from BindingDB
Found 1 hit for monomerid = 50322505
TargetIleal sodium/bile acid cotransporter(Homo sapiens (Human))
University Of Maryland
Curated by ChEMBL
LigandPNGBDBM50322505((2S)-2-((4R)-4-((3R,7R,8R,9S,10S,13R,14S,17R)-3,7-...)
Affinity DataKi:  6.09E+3nM. Assay description: Inhibition of human ASBT expressed in MDCK cells assessed as inhibition of [3H]taurocholic acid uptake after 10 mins by liquid scintillation counting
In DepthDetails ArticlePubMed