BDBM50322653 (2S,5S,8S,11S,14S,17S)-17-amino-8-(cyclohexylmethyl)-2-(3-guanidinopropyl)-11-((R)-1-hydroxyethyl)-14-isobutyl-5-methyl-4,7,10,13,16-pentaoxo-18-phenyl-3,6,9,12,15-pentaazaoctadecan-1-oic acid::CHEMBL1170644
SMILES [#6]-[#6](-[#6])-[#6]-[#6@H](-[#7]-[#6](=O)-[#6@@H](-[#7])-[#6]-c1ccccc1)-[#6](=O)-[#7]-[#6@@H](-[#6@@H](-[#6])-[#8])-[#6](=O)-[#7]-[#6@@H](-[#6]-[#6]-1-[#6]-[#6]-[#6]-[#6]-[#6]-1)-[#6](=O)-[#7]-[#6@@H](-[#6])-[#6](=O)-[#7]-[#6@@H](-[#6]-[#6]-[#6]\[#7]=[#6](/[#7])-[#7])-[#6](-[#8])=O
InChI Key InChIKey=ROYIXXQVYDOQCN-IIPGPKNTSA-N
Data  3 IC50
  Tab Delimited (TSV)   2D SDfile   Computed 3D by Vconf -m prep SDfile
Find this compound or compounds like it in BindingDB:
Activity Spreadsheet -- Enzyme Inhibition Constant Data from BindingDB
Found 3 hits for monomerid = 50322653
TargetC3a anaphylatoxin chemotactic receptor(Homo sapiens (Human))
The University Of Queensland
Curated by ChEMBL
LigandPNGBDBM50322653((2S,5S,8S,11S,14S,17S)-17-amino-8-(cyclohexylmethy...)
Affinity DataIC50:  240nM. Assay description: Displacement of [125I-C3a] from C3a receptor in human PBMC by scintillation counting
In DepthDetails ArticlePubMed
TargetC3a anaphylatoxin chemotactic receptor(Homo sapiens (Human))
The University Of Queensland
Curated by ChEMBL
LigandPNGBDBM50322653((2S,5S,8S,11S,14S,17S)-17-amino-8-(cyclohexylmethy...)
Affinity DataIC50:  240nM. Assay description: Displacement of [125I-C3a] from C3a receptor in human PBMC by scintillation counting
In DepthDetails ArticlePubMed
TargetC3a anaphylatoxin chemotactic receptor(Homo sapiens (Human))
The University Of Queensland
Curated by ChEMBL
LigandPNGBDBM50322653((2S,5S,8S,11S,14S,17S)-17-amino-8-(cyclohexylmethy...)
Affinity DataIC50:  240nM. Assay description: Antagonist activity at human C3a receptor in human U937 cells assessed as inhibition of intracellular calcium mobilization
In DepthDetails ArticlePubMed