BDBM50322716 3-benzyl-5-(4-(benzyloxy)benzylidene)thiazolidine-2,4-dione::CHEMBL1173236
SMILES O=C1S\C(=C/c2ccc(OCc3ccccc3)cc2)C(=O)N1Cc1ccccc1
InChI Key InChIKey=DRPKSOZBVYKXIS-JCMHNJIXSA-N
Data  1 IC50
  Tab Delimited (TSV)   2D SDfile   Computed 3D by Vconf -m prep SDfile
Find this compound or compounds like it in BindingDB:
Activity Spreadsheet -- Enzyme Inhibition Constant Data from BindingDB
Found 1 hit for monomerid = 50322716
TargetEctonucleotide pyrophosphatase/phosphodiesterase family member 2(Homo sapiens (Human))
Institute
Curated by ChEMBL
LigandPNGBDBM50322716(3-benzyl-5-(4-(benzyloxy)benzylidene)thiazolidine-...)
Affinity DataIC50:  2.69E+3nM. Assay description: Inhibition of 6x-histidine-tagged human recombinant ATX expressed in HEK293 cells using bisP-nitrophenyl phosphate as a substrate
In DepthDetails ArticlePubMed