BDBM50323031 4-((1S,2S,6R,7R)-9-Ethanesulfonyl-1,7-dimethyl-3,5-dioxo-11-oxa-4,9-diaza-tricyclo[5.3.1.0*2,6*]undec-4-yl)-2-trifluoromethyl-benzonitrile::CHEMBL1210036
SMILES CCS(=O)(=O)N1C[C@]2(C)O[C@](C)(C1)c1c(O)n(c(O)c21)-c1ccc(C#N)c(c1)C(F)(F)F
InChI Key InChIKey=OGQHYGZHXUFMSU-KDURUIRLSA-N
Data  1 KI  2 IC50
  Tab Delimited (TSV)   2D SDfile   Computed 3D by Vconf -m prep SDfile
Find this compound or compounds like it in BindingDB:
Activity Spreadsheet -- Enzyme Inhibition Constant Data from BindingDB
Found 3 hits for monomerid = 50323031
TargetAndrogen receptor(Homo sapiens (Human))
Bristol-Myers Squibb
Curated by ChEMBL
LigandPNGBDBM50323031(4-((1S,2S,6R,7R)-9-Ethanesulfonyl-1,7-dimethyl-3,5...)
Affinity DataKi:  16nM. Assay description: Displacement of [3H]DHT from AR in human MDA-MB-453 cells
In DepthDetails ArticlePubMed
TargetAndrogen receptor(Homo sapiens (Human))
Bristol-Myers Squibb
Curated by ChEMBL
LigandPNGBDBM50323031(4-((1S,2S,6R,7R)-9-Ethanesulfonyl-1,7-dimethyl-3,5...)
Affinity DataIC50:  85nM. Assay description: Antagonist activity at human wild type AR expressed in human MDA-MB-435 cells by transactivation assay
In DepthDetails ArticlePubMed
TargetAndrogen receptor(Homo sapiens (Human))
Bristol-Myers Squibb
Curated by ChEMBL
LigandPNGBDBM50323031(4-((1S,2S,6R,7R)-9-Ethanesulfonyl-1,7-dimethyl-3,5...)
Affinity DataIC50:  600nM. Assay description: Antagonist activity at wild type human AR expressed in human LNCAP cells by transactivation assay
In DepthDetails ArticlePubMed