BDBM50323095 (R)-5-(5-(2-(2-(dimethylamino)ethylamino)pyridin-4-yl)-1H-benzo[d]imidazol-1-yl)-3-(1-(2-(trifluoromethyl)phenyl)ethoxy)thiophene-2-carboxamide::CHEMBL1208961
SMILES C[C@@H](Oc1cc(sc1C(N)=O)-n1cnc2cc(ccc12)-c1ccnc(NCCN(C)C)c1)c1ccccc1C(F)(F)F
InChI Key InChIKey=RTYHQIZCRYJKBV-GOSISDBHSA-N
Data  4 IC50
  Tab Delimited (TSV)   2D SDfile   Computed 3D by Vconf -m prep SDfile
Find this compound or compounds like it in BindingDB:
Activity Spreadsheet -- Enzyme Inhibition Constant Data from BindingDB
Found 4 hits for monomerid = 50323095
TargetCytochrome P450 2C9(Homo sapiens (Human))
Glaxosmithkline
Curated by ChEMBL
LigandPNGBDBM50323095((R)-5-(5-(2-(2-(dimethylamino)ethylamino)pyridin-4...)
Affinity DataIC50:  900nM. Assay description: Inhibition of human recombinant CYP2C9 using 7-methoxy-4-trifluoromethylcoumarin-3-acetic acid as substrate by fluorescence plate reader
In DepthDetails ArticlePubMed
TargetSerine/threonine-protein kinase PLK1(Homo sapiens (Human))
Glaxosmithkline
Curated by ChEMBL
LigandPNGBDBM50323095((R)-5-(5-(2-(2-(dimethylamino)ethylamino)pyridin-4...)
Affinity DataIC50:  3nM. Assay description: Inhibition of PLK1 by SPA assay
In DepthDetails ArticlePubMed
TargetCytochrome P450 3A4(Homo sapiens (Human))
Glaxosmithkline
Curated by ChEMBL
LigandPNGBDBM50323095((R)-5-(5-(2-(2-(dimethylamino)ethylamino)pyridin-4...)
Affinity DataIC50:  2.70E+4nM. Assay description: Inhibition of human recombinant CYP3A4 using 7-benzyloxyquinoline as substrate by fluorescence plate reader
In DepthDetails ArticlePubMed
TargetCytochrome P450 3A4(Homo sapiens (Human))
Glaxosmithkline
Curated by ChEMBL
LigandPNGBDBM50323095((R)-5-(5-(2-(2-(dimethylamino)ethylamino)pyridin-4...)
Affinity DataIC50:  800nM. Assay description: Inhibition of human recombinant CYP3A4 using diethoxyfluorescein as substrate by fluorescence plate reader
In DepthDetails ArticlePubMed