BDBM50323104 (R)-3-(1-(2-chlorophenyl)ethoxy)-5-(5-(2-(4-methylpiperazin-1-yl)pyridin-4-yl)-1H-benzo[d]imidazol-1-yl)thiophene-2-carboxamide::CHEMBL1208958
SMILES C[C@@H](Oc1cc(sc1C(N)=O)-n1cnc2cc(ccc12)-c1ccnc(c1)N1CCN(C)CC1)c1ccccc1Cl
InChI Key InChIKey=ORZOCBRCPCCQDN-LJQANCHMSA-N
Data  3 IC50
  Tab Delimited (TSV)   2D SDfile   Computed 3D by Vconf -m prep SDfile
Find this compound or compounds like it in BindingDB:
Activity Spreadsheet -- Enzyme Inhibition Constant Data from BindingDB
Found 3 hits for monomerid = 50323104
TargetCytochrome P450 3A4(Homo sapiens (Human))
Glaxosmithkline
Curated by ChEMBL
LigandPNGBDBM50323104((R)-3-(1-(2-chlorophenyl)ethoxy)-5-(5-(2-(4-methyl...)
Affinity DataIC50:  1.10E+3nM. Assay description: Inhibition of human recombinant CYP3A4 using diethoxyfluorescein as substrate by fluorescence plate reader
In DepthDetails ArticlePubMed
TargetSerine/threonine-protein kinase PLK1(Homo sapiens (Human))
Glaxosmithkline
Curated by ChEMBL
LigandPNGBDBM50323104((R)-3-(1-(2-chlorophenyl)ethoxy)-5-(5-(2-(4-methyl...)
Affinity DataIC50:  2nM. Assay description: Inhibition of PLK1 by SPA assay
In DepthDetails ArticlePubMed
TargetCytochrome P450 3A4(Homo sapiens (Human))
Glaxosmithkline
Curated by ChEMBL
LigandPNGBDBM50323104((R)-3-(1-(2-chlorophenyl)ethoxy)-5-(5-(2-(4-methyl...)
Affinity DataIC50:  2.70E+4nM. Assay description: Inhibition of human recombinant CYP3A4 using 7-benzyloxyquinoline as substrate by fluorescence plate reader
In DepthDetails ArticlePubMed