BDBM50323130 (R)-(3-methyl-4-(4-(4-morpholinophenyl)phthalazin-1-yl)piperazin-1-yl)(phenyl)methanone::CHEMBL1209133
SMILES C[C@@H]1CN(CCN1c1nnc(-c2ccc(cc2)N2CCOCC2)c2ccccc12)C(=O)c1ccccc1
InChI Key InChIKey=FZXUFZJZLNPHCP-JOCHJYFZSA-N
Data  1 IC50
  Tab Delimited (TSV)   2D SDfile   Computed 3D by Vconf -m prep SDfile
Find this compound or compounds like it in BindingDB:
Activity Spreadsheet -- Enzyme Inhibition Constant Data from BindingDB
Found 1 hit for monomerid = 50323130
TargetSmoothened homolog(Homo sapiens (Human))
Amgen
Curated by ChEMBL
LigandPNGBDBM50323130((R)-(3-methyl-4-(4-(4-morpholinophenyl)phthalazin-...)
Affinity DataIC50:  21nM. Assay description: Antagonist activity at human Smo receptor in HEPM cells assessed as inhibition of Gli expression after 24 hrs by quantigene assay
In DepthDetails ArticlePubMed