BDBM50323208 CHEMBL453479::kayaflavone
SMILES COc1ccc(cc1)-c1cc(=O)c2c(O)cc(OC)c(-c3cc(ccc3OC)-c3cc(O)c4c(cc(O)cc4=O)o3)c2o1
InChI Key InChIKey=FCQMIBDRYZYMJV-UHFFFAOYSA-N
Data  2 IC50
  Tab Delimited (TSV)   2D SDfile   Computed 3D by Vconf -m prep SDfile
Find this compound or compounds like it in BindingDB:
Activity Spreadsheet -- Enzyme Inhibition Constant Data from BindingDB
Found 2 hits for monomerid = 50323208
TargetAmyloid-beta precursor protein(Homo sapiens (Human))
Meiji Pharmaceutical University
Curated by ChEMBL
LigandPNGBDBM50323208(CHEMBL453479 | kayaflavone)
Affinity DataIC50: >5.00E+4nM. Assay description: Inhibition of human amyloid beta (1 to 40) assessed as reduction in aggregation measured after 24 hrs by ThT fluorescence assay
In DepthDetails ArticlePubMed
TargetBeta-secretase 1(Homo sapiens (Human))
Shujitsu University
Curated by ChEMBL
LigandPNGBDBM50323208(CHEMBL453479 | kayaflavone)
Affinity DataIC50: >1.00E+4nM. Assay description: Inhibition of BACE1 after 60 mins by FRET assay
In DepthDetails ArticlePubMed