BDBM50323537 3-(((3-chloro-5-((3-(2,6-dichlorophenyl)-5-isopropylisoxazol-4-yl)methoxy)pyridin-2-yl)(methyl)amino)methyl)benzoic acid::CHEMBL1209228
SMILES CC(C)c1onc(c1COc1cnc(N(C)Cc2cccc(c2)C(O)=O)c(Cl)c1)-c1c(Cl)cccc1Cl
InChI Key InChIKey=IIBBKFGPSAHSTP-UHFFFAOYSA-N
Data  3 EC50
  Tab Delimited (TSV)   2D SDfile   Computed 3D by Vconf -m prep SDfile
Find this compound or compounds like it in BindingDB:
Activity Spreadsheet -- Enzyme Inhibition Constant Data from BindingDB
Found 3 hits for monomerid = 50323537
TargetBile acid receptor(Homo sapiens (Human))
Phenex Pharmaceuticals
Curated by ChEMBL
LigandPNGBDBM50323537(3-(((3-chloro-5-((3-(2,6-dichlorophenyl)-5-isoprop...)
Affinity DataEC50:  61nM. Assay description: Agonist activity at human full length FXR transfected in HEK293 cells coexpressing pTRexDest/pGL2promotor assessed as luciferase activity by direct r...
In DepthDetails ArticlePubMed
TargetBile acid receptor(Homo sapiens (Human))
Phenex Pharmaceuticals
Curated by ChEMBL
LigandPNGBDBM50323537(3-(((3-chloro-5-((3-(2,6-dichlorophenyl)-5-isoprop...)
Affinity DataEC50:  190nM. Assay description: Agonist activity at human GST-fused FXR LBD expressed in HEK293 cells coexpressing GAL4-DNA bindig domain and pFRluc by mammalian one-hybrid assay
In DepthDetails ArticlePubMed
TargetBile acid receptor(Homo sapiens (Human))
Phenex Pharmaceuticals
Curated by ChEMBL
LigandPNGBDBM50323537(3-(((3-chloro-5-((3-(2,6-dichlorophenyl)-5-isoprop...)
Affinity DataEC50:  100nM. Assay description: Agonist activity at human GST-fused FXR LBD expressed in HEK293 cells coexpressing GAL4-DNA bindig domain and pFRluc by mammalian one-hybrid assay
In DepthDetails ArticlePubMed