BDBM50323626 4-(6-p-tolylquinolin-4-ylamino)benzonitrile::CHEMBL1208827
SMILES Cc1ccc(cc1)-c1ccc2nccc(Nc3ccc(cc3)C#N)c2c1
InChI Key InChIKey=QYAXSXIJHHOIDS-UHFFFAOYSA-N
Data  1 IC50
  Tab Delimited (TSV)   2D SDfile   Computed 3D by Vconf -m prep SDfile
Find this compound or compounds like it in BindingDB:
Activity Spreadsheet -- Enzyme Inhibition Constant Data from BindingDB
Found 1 hit for monomerid = 50323626
TargetMAP kinase-activated protein kinase 2(Homo sapiens (Human))
Astrazeneca R & D Lund
Curated by ChEMBL
LigandPNGBDBM50323626(4-(6-p-tolylquinolin-4-ylamino)benzonitrile | CHEM...)
Affinity DataIC50:  2.70E+4nM. Assay description: Inhibition of MK2 assessed as inhibition of [33P]ATP incorporation in to substrate after 30 mins by scintillation counting
In DepthDetails ArticlePubMed