BDBM50323676 CHEMBL1209184::rac-exo-[6-(2-(4-Aminopyridin-3-yl)phenoxy))]-3-azabicyclo[3.2.1]octane hydrochloride
SMILES Nc1ccncc1-c1ccccc1O[C@H]1C[C@H]2C[C@@H]1CNC2
InChI Key InChIKey=DQKGYJNWJXXUPR-VFVRVIDISA-N
Data  1 KI
  Tab Delimited (TSV)   2D SDfile   Computed 3D by Vconf -m prep SDfile
Find this compound or compounds like it in BindingDB:
Activity Spreadsheet -- Enzyme Inhibition Constant Data from BindingDB
Found 1 hit for monomerid = 50323676
TargetNeuronal acetylcholine receptor subunit alpha-4/beta-2(Homo sapiens (Human))
Pfizer
Curated by ChEMBL
LigandPNGBDBM50323676(CHEMBL1209184 | rac-exo-[6-(2-(4-Aminopyridin-3-yl...)
Affinity DataKi: >1.04E+3nM. Assay description: Displacement of [3H]epibatidine from alpha4beta2 nicotinic receptor expressed in human HEK293 cells
In DepthDetails ArticlePubMed