BDBM50323724 CHEMBL1213660::S-phenyl 3-(4-hydroxy-3,5-dimethylstyryl)benzothioate
SMILES Cc1cc(\C=C\c2cccc(c2)C(=O)Sc2ccccc2)cc(C)c1O
InChI Key InChIKey=FXFWECMBRQGCCF-VAWYXSNFSA-N
Data  1 IC50
  Tab Delimited (TSV)   2D SDfile   Computed 3D by Vconf -m prep SDfile
Find this compound or compounds like it in BindingDB:
Activity Spreadsheet -- Enzyme Inhibition Constant Data from BindingDB
Found 1 hit for monomerid = 50323724
TargetTransthyretin(Homo sapiens (Human))
The Scripps Research Institute
Curated by ChEMBL
LigandPNGBDBM50323724(CHEMBL1213660 | S-phenyl 3-(4-hydroxy-3,5-dimethyl...)
Affinity DataIC50:  2.00E+3nMpH: 4.4Assay Description:Inhibition of wild type TTR amyloidogenesis assessed as inhibition of fibril formation after 72 hrs at pH 4.4 by spectrophotometry relative to untrea...
In DepthDetails ArticlePubMed