BDBM50323929 3-Ketoadociaquinone B::CHEMBL1214422
SMILES C[C@@]12CCC(=O)c3coc(c13)C(=O)c1cc3C(=O)C4=NCCS(=O)(=O)C4C(=O)c3cc21
InChI Key InChIKey=VFXKGAPHDXOYGS-KEKNWZKVSA-N
Data  1 IC50
  Tab Delimited (TSV)   2D SDfile   Computed 3D by Vconf -m prep SDfile
Find this compound or compounds like it in BindingDB:
Activity Spreadsheet -- Enzyme Inhibition Constant Data from BindingDB
Found 1 hit for monomerid = 50323929
TargetPhospholipase A2(Apis mellifera)
National Museum Of Natural History
Curated by ChEMBL
LigandPNGBDBM50323929(3-Ketoadociaquinone B | CHEMBL1214422)
Affinity DataIC50:  1.05E+5nM. Assay description: Inhibition of bee venom phospholipase A2 after 5 mins by spectrophotometric analysis
In DepthDetails ArticlePubMed