BDBM50324097 CHEMBL1214831::N-(Benzofuran-2-ylmethyl)-N'-(4'-ethoxybenzyl)piperazine
SMILES CCOc1ccc(CN2CCN(Cc3cc4ccccc4o3)CC2)cc1
InChI Key InChIKey=SARQYPUTTRFHLZ-UHFFFAOYSA-N
Data  5 KI
  Tab Delimited (TSV)   2D SDfile   Computed 3D by Vconf -m prep SDfile
Find this compound or compounds like it in BindingDB:
Activity Spreadsheet -- Enzyme Inhibition Constant Data from BindingDB
Found 5 hits for monomerid = 50324097
TargetSigma non-opioid intracellular receptor 1(Cavia porcellus (Guinea pig))
The University Of Sydney
Curated by ChEMBL
LigandPNGBDBM50324097(CHEMBL1214831 | N-(Benzofuran-2-ylmethyl)-N'-(4'-e...)
Affinity DataKi:  0.180nM. Assay description: Displacement of [3H](+)-pentazocine from sigma1 receptor in guinea pig brain homogenate
In DepthDetails ArticlePubMed
TargetSigma non-opioid intracellular receptor 1(RAT)
University Of Sydney
Curated by ChEMBL
LigandPNGBDBM50324097(CHEMBL1214831 | N-(Benzofuran-2-ylmethyl)-N'-(4'-e...)
Affinity DataKi:  10.6nM. Assay description: Displacement of [3H]pentazocine from sigma1 receptor in rat brain homogenate
In DepthDetails ArticlePubMed
Target5-hydroxytryptamine receptor 2B(Homo sapiens (Human))
University Of Sydney
Curated by ChEMBL
LigandPNGBDBM50324097(CHEMBL1214831 | N-(Benzofuran-2-ylmethyl)-N'-(4'-e...)
Affinity DataKi:  262nM. Assay description: Binding affinity to 5HT2B
In DepthDetails ArticlePubMed
Target5-hydroxytryptamine receptor 1A(Homo sapiens (Human))
University Of Sydney
Curated by ChEMBL
LigandPNGBDBM50324097(CHEMBL1214831 | N-(Benzofuran-2-ylmethyl)-N'-(4'-e...)
Affinity DataKi:  3.34E+3nM. Assay description: Binding affinity to 5HT1A
In DepthDetails ArticlePubMed
TargetD(2) dopamine receptor(Homo sapiens (Human))
University Of Sydney
Curated by ChEMBL
LigandPNGBDBM50324097(CHEMBL1214831 | N-(Benzofuran-2-ylmethyl)-N'-(4'-e...)
Affinity DataKi:  4.87E+3nM. Assay description: Binding affinity to dopamine D2
In DepthDetails ArticlePubMed