BDBM50324321 6-(2-Cyclohexylaminopyridin-4-yl)-4-piperazin-1-yl-2,3-dihydropyrrolo[3,4-c]pyridin-1-one::CHEMBL1215362
SMILES O=C1NCc2c1cc(nc2N1CCNCC1)-c1ccnc(NC2CCCCC2)c1
InChI Key InChIKey=ORPHPLREHJAPID-UHFFFAOYSA-N
Data  1 IC50  1 EC50
  Tab Delimited (TSV)   2D SDfile   Computed 3D by Vconf -m prep SDfile
Find this compound or compounds like it in BindingDB:
Activity Spreadsheet -- Enzyme Inhibition Constant Data from BindingDB
Found 2 hits for monomerid = 50324321
TargetSerine/threonine-protein kinase D1(Homo sapiens (Human))
Novartis Institutes For Biomedical Research
Curated by ChEMBL
LigandPNGBDBM50324321(6-(2-Cyclohexylaminopyridin-4-yl)-4-piperazin-1-yl...)
Affinity DataIC50:  35nM. Assay description: Inhibition of PKD1 by TR-FRET assay
In DepthDetails ArticlePubMed
TargetSerine/threonine-protein kinase D1(Homo sapiens (Human))
Novartis Institutes For Biomedical Research
Curated by ChEMBL
LigandPNGBDBM50324321(6-(2-Cyclohexylaminopyridin-4-yl)-4-piperazin-1-yl...)
Affinity DataEC50: >1.00E+3nM. Assay description: Inhibition of PKD1 assessed as inhibition of HDAC5 neuclear export
In DepthDetails ArticlePubMed