BDBM50324383 (E)-4-(4-oxo-2-(3-(trifluoromethyl)styryl)quinazolin-3(4H)-yl)benzoic acid::CHEMBL1215004
SMILES OC(=O)c1ccc(cc1)-n1c(\C=C\c2cccc(c2)C(F)(F)F)nc2ccccc2c1=O
InChI Key InChIKey=JEMKIWNHLLSANA-MDWZMJQESA-N
Data  4 IC50
  Tab Delimited (TSV)   2D SDfile   Computed 3D by Vconf -m prep SDfile
Find this compound or compounds like it in BindingDB:
Activity Spreadsheet -- Enzyme Inhibition Constant Data from BindingDB
Found 4 hits for monomerid = 50324383
TargetGlutamate receptor 1(Rattus norvegicus (Rat))
Emory University
Curated by ChEMBL
LigandPNGBDBM50324383((E)-4-(4-oxo-2-(3-(trifluoromethyl)styryl)quinazol...)
Affinity DataIC50:  2.20E+4nM. Assay description: Antagonist activity at rat recombinant GLuR1 expressed in Xenopus oocytes assessed as inhibition of glutamate-induced current by two-electrode voltag...
In DepthDetails ArticlePubMed
TargetGlutamate receptor ionotropic, NMDA 1/2A(Rattus norvegicus (Rat))
Emory University
Curated by ChEMBL
LigandPNGBDBM50324383((E)-4-(4-oxo-2-(3-(trifluoromethyl)styryl)quinazol...)
Affinity DataIC50:  1.30E+4nM. Assay description: Antagonist activity at rat recombinant NR1-NR2A receptor expressed in Xenopus oocytes at holding potential of -40mV by two-electrode voltage-clamp el...
In DepthDetails ArticlePubMed
TargetGlutamate receptor ionotropic, NMDA 1/2B(Rattus norvegicus (Rat))
Emory University
Curated by ChEMBL
LigandPNGBDBM50324383((E)-4-(4-oxo-2-(3-(trifluoromethyl)styryl)quinazol...)
Affinity DataIC50:  2.60E+4nM. Assay description: Antagonist activity at rat recombinant NR1-NR2B receptor expressed in Xenopus oocytes at holding potential of -40mV by two-electrode voltage-clamp el...
In DepthDetails ArticlePubMed
TargetGlutamate receptor ionotropic, NMDA 1/2C(RAT)
Emory University
Curated by ChEMBL
LigandPNGBDBM50324383((E)-4-(4-oxo-2-(3-(trifluoromethyl)styryl)quinazol...)
Affinity DataIC50:  1.20E+4nM. Assay description: Antagonist activity at rat recombinant NR1-NR2C receptor expressed in Xenopus oocytes at holding potential of -40mV by two-electrode voltage-clamp el...
In DepthDetails ArticlePubMed