BDBM50324445 (E)-6-iodo-3-(2-methoxyphenyl)-2-(2-(pyridin-3-yl)vinyl)quinazolin-4(3H)-one::CHEMBL1214865
SMILES COc1ccccc1-n1c(\C=C\c2cccnc2)nc2ccc(I)cc2c1=O
InChI Key InChIKey=CDEPFBOADPQNNG-DHZHZOJOSA-N
Data  4 IC50
  Tab Delimited (TSV)   2D SDfile   Computed 3D by Vconf -m prep SDfile
Find this compound or compounds like it in BindingDB:
Activity Spreadsheet -- Enzyme Inhibition Constant Data from BindingDB
Found 4 hits for monomerid = 50324445
TargetGlutamate receptor ionotropic, NMDA 1/2C(RAT)
Emory University
Curated by ChEMBL
LigandPNGBDBM50324445((E)-6-iodo-3-(2-methoxyphenyl)-2-(2-(pyridin-3-yl)...)
Affinity DataIC50:  3.00E+3nM. Assay description: Antagonist activity at rat recombinant NR1-NR2C receptor expressed in Xenopus oocytes at holding potential of -40mV by two-electrode voltage-clamp el...
In DepthDetails ArticlePubMed
TargetGlutamate receptor ionotropic, NMDA 1/2B(Rattus norvegicus (Rat))
Emory University
Curated by ChEMBL
LigandPNGBDBM50324445((E)-6-iodo-3-(2-methoxyphenyl)-2-(2-(pyridin-3-yl)...)
Affinity DataIC50:  3.00E+4nM. Assay description: Antagonist activity at rat recombinant NR1-NR2B receptor expressed in Xenopus oocytes at holding potential of -40mV by two-electrode voltage-clamp el...
In DepthDetails ArticlePubMed
TargetGlutamate receptor ionotropic, NMDA 1/2A(Rattus norvegicus (Rat))
Emory University
Curated by ChEMBL
LigandPNGBDBM50324445((E)-6-iodo-3-(2-methoxyphenyl)-2-(2-(pyridin-3-yl)...)
Affinity DataIC50:  3.10E+4nM. Assay description: Antagonist activity at rat recombinant NR1-NR2A receptor expressed in Xenopus oocytes at holding potential of -40mV by two-electrode voltage-clamp el...
In DepthDetails ArticlePubMed
TargetGlutamate receptor 1(Rattus norvegicus (Rat))
Emory University
Curated by ChEMBL
LigandPNGBDBM50324445((E)-6-iodo-3-(2-methoxyphenyl)-2-(2-(pyridin-3-yl)...)
Affinity DataIC50:  1.99E+5nM. Assay description: Antagonist activity at rat recombinant GLuR1 expressed in Xenopus oocytes assessed as inhibition of glutamate-induced current by two-electrode voltag...
In DepthDetails ArticlePubMed