BDBM50324561 1-(4-Fluorophenyl)-2-[4-(1-methyl-1H-pyrazole-3-carbonyl)-piperazin-1-yl]ethanone::CHEMBL1214810
SMILES Cn1ccc(n1)C(=O)N1CCN(CC(=O)c2ccc(F)cc2)CC1
InChI Key InChIKey=SGCIVAJSWROLHV-UHFFFAOYSA-N
Data  2 KI
  Tab Delimited (TSV)   2D SDfile   Computed 3D by Vconf -m prep SDfile
Find this compound or compounds like it in BindingDB:
Activity Spreadsheet -- Enzyme Inhibition Constant Data from BindingDB
Found 2 hits for monomerid = 50324561
Target5-hydroxytryptamine receptor 2A(Homo sapiens (Human))
Arena Pharmaceuticals
Curated by ChEMBL
LigandPNGBDBM50324561(1-(4-Fluorophenyl)-2-[4-(1-methyl-1H-pyrazole-3-ca...)
Affinity DataKi:  37nM. Assay description: Displacement of [125I]DOI from human recombinant 5HT2A receptor expressed in HEK293 cells after 1 hr by scintillation counting
In DepthDetails ArticlePubMed
Target5-hydroxytryptamine receptor 2C(Homo sapiens (Human))
Arena Pharmaceuticals
Curated by ChEMBL
LigandPNGBDBM50324561(1-(4-Fluorophenyl)-2-[4-(1-methyl-1H-pyrazole-3-ca...)
Affinity DataKi:  1.42E+3nM. Assay description: Displacement of [125I]DOI from human recombinant 5HT2C receptor expressed in HEK293 cells after 1 hr by scintillation counting
In DepthDetails ArticlePubMed