BDBM50324705 CHEMBL1222079
SMILES CSCC[C@H](NC(=O)[C@H](CC(C)C)NC(=O)[C@H](Cc1c[nH]c2ccccc12)NC(=O)[C@H](CCC(N)=O)NC(=O)[C@@H](NC(=O)[C@H](Cc1ccccc1)NC(=O)[C@H](CC(O)=O)NC(=O)[C@H](CCC(N)=O)NC(=O)[C@H](C)NC(=O)[C@H](CCCN=C(N)N)NC(=O)[C@H](CCCN=C(N)N)NC(=O)[C@H](CCC(N)=O)NC(=O)[C@H](CC(O)=O)NC(=O)[C@H](CC(C)C)NC(=O)[C@H](Cc1ccc(O)cc1)NC(=O)[C@H](CCCCN)NC(=O)[C@H](CO)NC(=O)[C@H](Cc1ccc(O)cc1)NC(=O)[C@H](CC(O)=O)NC(=O)[C@H](CO)NC(=O)[C@@H](NC(=O)[C@H](Cc1ccccc1)NC(=O)[C@@H](NC(=O)CNC(=O)[C@H](CCC(N)=O)NC(=O)[C@H](CO)N[C@@H](Cc1cnc[nH]1)C(O)=O)[C@@H](C)O)[C@@H](C)O)C(C)C)C(=O)N[C@@H](CC(N)=O)C(=O)N[C@@H]([C@@H](C)O)C(N)=O
InChI Key InChIKey=VCPSGJGWQYJYOO-HMYWJLJYSA-N
Data  2 EC50
  Tab Delimited (TSV)   2D SDfile   Computed 3D by Vconf -m prep SDfile
Find this compound or compounds like it in BindingDB:
Activity Spreadsheet -- Enzyme Inhibition Constant Data from BindingDB
Found 2 hits for monomerid = 50324705
TargetGlucagon receptor(Homo sapiens (Human))
Indiana University
Curated by ChEMBL
LigandPNGBDBM50324705(CHEMBL1222079)
Affinity DataEC50:  0.0710nM. Assay description: Agonist activity at GCGR expressed in HEK293 cells assessed as stimulation of cAMP production by luciferase reporter gene assay
In DepthDetails ArticlePubMed
TargetGlucagon-like peptide 1 receptor(Homo sapiens (Human))
Indiana University
Curated by ChEMBL
LigandPNGBDBM50324705(CHEMBL1222079)
Affinity DataEC50:  0.260nM. Assay description: Agonist activity at GLP1R expressed in HEK293 cells assessed as stimulation of cAMP production by luciferase reporter gene assay
In DepthDetails ArticlePubMed