BDBM50324875 CHEMBL1221451::Naphthalene-2-sulfonicacid sec-butyl-[3-(4-methyl-piperazin-1-yl)-phenyl]-amide
SMILES CCC(C)N(c1cccc(c1)N1CCN(C)CC1)S(=O)(=O)c1ccc2ccccc2c1
InChI Key InChIKey=REEWPGMYPPBRBX-UHFFFAOYSA-N
Data  1 IC50
  Tab Delimited (TSV)   2D SDfile   Computed 3D by Vconf -m prep SDfile
Find this compound or compounds like it in BindingDB:
Activity Spreadsheet -- Enzyme Inhibition Constant Data from BindingDB
Found 1 hit for monomerid = 50324875
Target5-hydroxytryptamine receptor 2C(Homo sapiens (Human))
Korea Research Institute Of Chemical Technology
Curated by ChEMBL
LigandPNGBDBM50324875(CHEMBL1221451 | Naphthalene-2-sulfonicacid sec-but...)
Affinity DataIC50:  168nM. Assay description: Displacement of [3H]mesulergine from human 5HT2C expressed in CHOKI cells
In DepthDetails ArticlePubMed