BDBM50325010 (R)-5-((6-methoxy-1-oxoisoindolin-2-yl)methyl)-5-(4-(2-methylpyridin-4-yl)phenyl)imidazolidine-2,4-dione::CHEMBL1223075
SMILES COc1ccc2CN(C[C@]3(NC(=O)NC3=O)c3ccc(cc3)-c3ccnc(C)c3)C(=O)c2c1
InChI Key InChIKey=HGPPYGXNQCWPLJ-VWLOTQADSA-N
Data  1 KI
  Tab Delimited (TSV)   2D SDfile   Computed 3D by Vconf -m prep SDfile
Find this compound or compounds like it in BindingDB:
Activity Spreadsheet -- Enzyme Inhibition Constant Data from BindingDB
Found 1 hit for monomerid = 50325010
TargetDisintegrin and metalloproteinase domain-containing protein 17(Homo sapiens (Human))
Merck Research Laboratories
Curated by ChEMBL
LigandPNGBDBM50325010((R)-5-((6-methoxy-1-oxoisoindolin-2-yl)methyl)-5-(...)
Affinity DataKi:  0.5nM. Assay description: Inhibition of TACE assessed as inhibition of pro-TNFalpha peptide cleavage
In DepthDetails ArticlePubMed