BDBM50325196 (Z)-1-(4-Methylbenzyl)-4-((6-methoxy-3-oxobenzofuran-2(3H)-ylidene)methyl)pyridinium chloride::CHEMBL1222961
SMILES COc1ccc2C(=O)\C(Oc2c1)=C\c1cc[n+](Cc2ccc(C)cc2)cc1
InChI Key InChIKey=GVOZSOFQWPXFRC-XKZIYDEJSA-N
Data  1 IC50
  Tab Delimited (TSV)   2D SDfile   Computed 3D by Vconf -m prep SDfile
Find this compound or compounds like it in BindingDB:
Activity Spreadsheet -- Enzyme Inhibition Constant Data from BindingDB
Found 1 hit for monomerid = 50325196
TargetAcetylcholinesterase(Electrophorus electricus (Electric eel))
Tehran University Of Medical Sciences
Curated by ChEMBL
LigandPNGBDBM50325196((Z)-1-(4-Methylbenzyl)-4-((6-methoxy-3-oxobenzofur...)
Affinity DataIC50:  475nM. Assay description: Inhibition of electric eel AChE by Ellman's method
In DepthDetails ArticlePubMed