BDBM50325207 (Z)-1-(4-Fluorobenzyl)-4-((6-propoxy-3-oxobenzofuran-2(3H)-ylidene)methyl)pyridinium bromide::CHEMBL1222896
SMILES CCCOc1ccc2C(=O)\C(Oc2c1)=C\c1cc[n+](Cc2ccc(F)cc2)cc1
InChI Key InChIKey=GABZAKWBTPADQH-UCQKPKSFSA-N
Data  1 IC50
  Tab Delimited (TSV)   2D SDfile   Computed 3D by Vconf -m prep SDfile
Find this compound or compounds like it in BindingDB:
Activity Spreadsheet -- Enzyme Inhibition Constant Data from BindingDB
Found 1 hit for monomerid = 50325207
TargetAcetylcholinesterase(Electrophorus electricus (Electric eel))
Tehran University Of Medical Sciences
Curated by ChEMBL
LigandPNGBDBM50325207((Z)-1-(4-Fluorobenzyl)-4-((6-propoxy-3-oxobenzofur...)
Affinity DataIC50:  68nM. Assay description: Inhibition of electric eel AChE by Ellman's method
In DepthDetails ArticlePubMed