BDBM50325736 (R)-1-(3-fluorophenyl)-N-((6-methoxy-4'-(trifluoromethyl)biphenyl-3-yl)methyl)ethanamine::CHEMBL1224342
SMILES COc1ccc(CN[C@H](C)c2cccc(F)c2)cc1-c1ccc(cc1)C(F)(F)F
InChI Key InChIKey=VWINXACDKLTYJX-OAHLLOKOSA-N
Data  2 EC50
  Tab Delimited (TSV)   2D SDfile   Computed 3D by Vconf -m prep SDfile
Find this compound or compounds like it in BindingDB:
Activity Spreadsheet -- Enzyme Inhibition Constant Data from BindingDB
Found 2 hits for monomerid = 50325736
TargetExtracellular calcium-sensing receptor(Homo sapiens (Human))
Amgen
Curated by ChEMBL
LigandPNGBDBM50325736((R)-1-(3-fluorophenyl)-N-((6-methoxy-4'-(trifluoro...)
Affinity DataEC50:  1.30E+3nM. Assay description: Positive allosteric modulation of calcium sensing receptor by FLIPR assay in absence of extracellular calcium
In DepthDetails ArticlePubMed
TargetExtracellular calcium-sensing receptor(Homo sapiens (Human))
Amgen
Curated by ChEMBL
LigandPNGBDBM50325736((R)-1-(3-fluorophenyl)-N-((6-methoxy-4'-(trifluoro...)
Affinity DataEC50:  37nM. Assay description: Positive allosteric modulation of calcium sensing receptor by FLIPR assay in presence of extracellular calcium
In DepthDetails ArticlePubMed