BDBM50325773 1-(2'-chlorobiphenyl-3-yl)-5-methyl-1H-pyrazole-3-carboxamide::CHEMBL1224345
SMILES Cc1cc(nn1-c1cccc(c1)-c1ccccc1Cl)C(N)=O
InChI Key InChIKey=VWNFLYGCSVZGIU-UHFFFAOYSA-N
Data  1 IC50
  Tab Delimited (TSV)   2D SDfile   Computed 3D by Vconf -m prep SDfile
Find this compound or compounds like it in BindingDB:
Activity Spreadsheet -- Enzyme Inhibition Constant Data from BindingDB
Found 1 hit for monomerid = 50325773
TargetSodium channel protein type 9 subunit alpha(Homo sapiens (Human))
Merck Research Laboratories
Curated by ChEMBL
LigandPNGBDBM50325773(1-(2'-chlorobiphenyl-3-yl)-5-methyl-1H-pyrazole-3-...)
Affinity DataIC50:  738nM. Assay description: Inhibition of human Nav 1.7 channel by voltage-ion-probe-reader
In DepthDetails ArticlePubMed