BDBM50325784 1-(2',6-bis(trifluoromethoxy)biphenyl-3-yl)-5-methyl-1H-pyrazole-3-carboxamide::CHEMBL1224515
SMILES Cc1cc(nn1-c1ccc(OC(F)(F)F)c(c1)-c1ccccc1OC(F)(F)F)C(N)=O
InChI Key InChIKey=BAMMIXKXERFRMR-UHFFFAOYSA-N
Data  1 IC50
  Tab Delimited (TSV)   2D SDfile   Computed 3D by Vconf -m prep SDfile
Find this compound or compounds like it in BindingDB:
Activity Spreadsheet -- Enzyme Inhibition Constant Data from BindingDB
Found 1 hit for monomerid = 50325784
TargetSodium channel protein type 9 subunit alpha(Homo sapiens (Human))
Merck Research Laboratories
Curated by ChEMBL
LigandPNGBDBM50325784(1-(2',6-bis(trifluoromethoxy)biphenyl-3-yl)-5-meth...)
Affinity DataIC50:  373nM. Assay description: Inhibition of human Nav 1.7 channel by voltage-ion-probe-reader
In DepthDetails ArticlePubMed