BDBM50326013 3-(acetoxyimino)-5-bromo-1-(2,5-dichlorobenzyl)indolin-2-one::CHEMBL1241673
SMILES CC(=O)ON=C1C(=O)N(Cc2cc(Cl)ccc2Cl)c2ccc(Br)cc12
InChI Key InChIKey=WFWZTHILOPGFPK-UHFFFAOYSA-N
Data  2 IC50
  Tab Delimited (TSV)   2D SDfile   Computed 3D by Vconf -m prep SDfile
Find this compound or compounds like it in BindingDB:
Activity Spreadsheet -- Enzyme Inhibition Constant Data from BindingDB
Found 2 hits for monomerid = 50326013
TargetUbiquitin carboxyl-terminal hydrolase isozyme L3(Homo sapiens (Human))
Institute For Bio-Medical Research
Curated by ChEMBL
LigandPNGBDBM50326013(3-(acetoxyimino)-5-bromo-1-(2,5-dichlorobenzyl)ind...)
Affinity DataIC50:  2.50E+4nM. Assay description: Inhibition of UCHL3 in human H1299 cells
In DepthDetails ArticlePubMed
TargetUbiquitin carboxyl-terminal hydrolase isozyme L1(Homo sapiens (Human))
Institute For Bio-Medical Research
Curated by ChEMBL
LigandPNGBDBM50326013(3-(acetoxyimino)-5-bromo-1-(2,5-dichlorobenzyl)ind...)
Affinity DataIC50:  880nM. Assay description: Inhibition of UCHL1 in human H1299 cells
In DepthDetails ArticlePubMed