BDBM50326044 (2S,5S,8R,11S,14S,17S,20S,23S,26R,29S,32S,35S,38S,41S,44S)-17,23,38-tris((1H-indol-3-yl)methyl)-44-amino-5,14,35,41-tetrakis(2-carboxyethyl)-2-(3-guanidinopropyl)-11,20-bis((R)-1-hydroxyethyl)-29-isobutyl-32-isopropyl-8,26-bis(mercaptomethyl)-4,7,10,13,16,19,22,25,28,31,34,37,40,43-tetradecaoxo-3,6,9,12,15,18,21,24,27,30,33,36,39,42-tetradecaazaheptatetracontane-1,47-dioic acid::CHEMBL1240681
SMILES CC(C)C[C@H](NC(=O)[C@@H](NC(=O)[C@H](CCC(O)=O)NC(=O)[C@H](Cc1c[nH]c2ccccc12)NC(=O)[C@H](CCC(O)=O)NC(=O)[C@@H](N)CCC(O)=O)C(C)C)C(=O)N[C@@H](CS)C(=O)N[C@@H](Cc1c[nH]c2ccccc12)C(=O)N[C@@H]([C@@H](C)O)C(=O)N[C@@H](Cc1c[nH]c2ccccc12)C(=O)N[C@@H](CCC(O)=O)C(=O)N[C@@H]([C@@H](C)O)C(=O)N[C@@H](CS)C(=O)N[C@@H](CCC(O)=O)C(=O)N[C@@H](CCCN=C(N)N)C(O)=O
InChI Key InChIKey=HEHUSGLLDRMNKT-XBFCTLRJSA-N
Data  1 IC50
  Tab Delimited (TSV)   2D SDfile   Computed 3D by Vconf -m prep SDfile
Find this compound or compounds like it in BindingDB:
Activity Spreadsheet -- Enzyme Inhibition Constant Data from BindingDB
Found 1 hit for monomerid = 50326044
TargetCoagulation factor VII/Tissue factor(Homo sapiens (Human))
Laboratory Of Molecular Biology, Medical Research Council
Curated by ChEMBL
LigandPNGBDBM50326044((2S,5S,8R,11S,14S,17S,20S,23S,26R,29S,32S,35S,38S,...)
Affinity DataIC50:  1.5nM. Assay description: Binding affinity to tissue factor/factor 7a
In DepthDetails ArticlePubMed