BDBM50326065 (E)-4-(2-(4-Fluorobenzylthio)-3-(4-chloro-3-nitrophenyl)acryloyl)benzoic acid::CHEMBL1242669
SMILES OC(=O)c1ccc(cc1)C(=O)C(\SCc1ccc(F)cc1)=C/c1ccc(Cl)c(c1)[N+]([O-])=O
InChI Key InChIKey=JOTZIFWMMIGBPN-CIAFOILYSA-N
Data  1 IC50
  Tab Delimited (TSV)   2D SDfile   Computed 3D by Vconf -m prep SDfile
Find this compound or compounds like it in BindingDB:
Activity Spreadsheet -- Enzyme Inhibition Constant Data from BindingDB
Found 1 hit for monomerid = 50326065
TargetBreakpoint cluster region protein/Tyrosine-protein kinase ABL1(Homo sapiens (Human))
Temple University School Of Medicine
Curated by ChEMBL
LigandPNGBDBM50326065((E)-4-(2-(4-Fluorobenzylthio)-3-(4-chloro-3-nitrop...)
Affinity DataIC50:  2.50E+3nM. Assay description: Inhibition of BCR/ABL p210 autophosphorylation in human K562 cells after 2 hrs by Western blot analysis
In DepthDetails ArticlePubMed