BDBM50326078 (E)-4-(2-(4-Bromobenzylsulfinyl)-3-(4-fluoro-3-nitrophenyl)acryloyl)benzoic acid::CHEMBL1241778
SMILES OC(=O)c1ccc(cc1)C(=O)C(=Cc1ccc(F)c(c1)[N+]([O-])=O)S(=O)Cc1ccc(Br)cc1
InChI Key InChIKey=AUXNJAHNXRMNJA-UHFFFAOYSA-N
Data  1 IC50
  Tab Delimited (TSV)   2D SDfile   Computed 3D by Vconf -m prep SDfile
Find this compound or compounds like it in BindingDB:
Activity Spreadsheet -- Enzyme Inhibition Constant Data from BindingDB
Found 1 hit for monomerid = 50326078
TargetBreakpoint cluster region protein/Tyrosine-protein kinase ABL1(Homo sapiens (Human))
Temple University School Of Medicine
Curated by ChEMBL
LigandPNGBDBM50326078((E)-4-(2-(4-Bromobenzylsulfinyl)-3-(4-fluoro-3-nit...)
Affinity DataIC50: >2.00E+4nM. Assay description: Inhibition of BCR/ABL p210 autophosphorylation in human K562 cells after 2 hrs by Western blot analysis
In DepthDetails ArticlePubMed