BDBM50326274 CHEMBL1240781
SMILES CC[C@H](C)[C@H](NC(=O)[C@H](Cc1ccccc1)NC(=O)[C@H](CCC(O)=O)NC(=O)[C@@H]1CCCCNC(=O)CC[C@H](NC(=O)[C@H](CCC(O)=O)NC(=O)[C@H](CC(C)C)NC(=O)[C@H](Cc2ccc(O)cc2)NC(=O)[C@H](CO)NC(=O)[C@H](CO)NC(=O)[C@@H](NC(=O)[C@H](CC(O)=O)NC(=O)[C@H](CO)NC(=O)[C@@H](NC(=O)[C@H](Cc2ccccc2)NC(=O)[C@@H](NC(=O)CNC(=O)[C@H](CCC(O)=O)NC(=O)[C@H](C)NC(=O)[C@@H](N)Cc2cnc[nH]2)[C@@H](C)O)[C@@H](C)O)C(C)C)C(=O)N[C@@H](CCC(N)=O)C(=O)N[C@@H](C)C(=O)N[C@@H](C)C(=O)N1)C(=O)N[C@H]1CCC(=O)NCCCC[C@H](NC(=O)[C@@H](NC(=O)[C@H](CC(C)C)NC(=O)[C@H](Cc2c[nH]c3ccccc23)NC1=O)C(C)C)C(=O)NCC(=O)N[C@@H](CCCNC(N)=N)C(N)=O
InChI Key InChIKey=TWIAHGFQEUYKDD-OEUJWTPRSA-N
Data  1 EC50
  Tab Delimited (TSV)   2D SDfile   Computed 3D by Vconf -m prep SDfile
Find this compound or compounds like it in BindingDB:
Activity Spreadsheet -- Enzyme Inhibition Constant Data from BindingDB
Found 1 hit for monomerid = 50326274
TargetGlucagon-like peptide 1 receptor(Homo sapiens (Human))
University Of Texas At Dallas
Curated by ChEMBL
LigandPNGBDBM50326274(CHEMBL1240781)
Affinity DataEC50:  1.60nM. Assay description: Activation of human GLP1 receptor expressed in HEK293 cells assessed as increase in cAMP accumulation
In DepthDetails ArticlePubMed